Статьи Галерея Форум Чат Файлы HowTo Ссылки Поиск
Текущее время: 10 дек 2018, 04:07




Начать новую тему Ответить на тему  [ Сообщений: 30 ]  На страницу 1, 2  След.
Автор Сообщение
СообщениеДобавлено: 23 сен 2005, 20:17 
Неотъемлемая часть форума
Аватара пользователя

У нас с: 03.11.2004
Сообщения: 1373
Откуда: Минск
Этот мануал раз и навсегда решит проблему с установкой модема Intel 536EP в Linux'е.

Официальные драйвера можно загрузить с вот этой странички.

НО !!! Эти драйвера работают только на тех системах, где установлено ядро до 2.6.12 версии, хотя возможно, что линейка 2.6.11 тоже не поддерживается (но это я не проверял).
К тому же официальные дрова не поддерживают Debian-like системы.


Итак ... Для установки драйверов требуется следующее :

    1)компилятор gcc (это установлено по умолчанию в 99% систем)
    2)ядро с поддержкой модулей (тоже повсеместно распространено)
    3)kernel-source-<_> и(или) kernel-headers-<_> (это скорее всего придётся устанавливать самому. если не установлены эти пакеты, то и драйвера не встанут .Проверить версию ядра можно этой командой : uname -r)
    Например если вышеизложенная команда выдаёт 2.6.8-2-686, то надо установить kernel-headers-2.6.8-2-686 и т.д.
    4)"Правильные" драйвера.
По сути вам придётся установить только исходники ядра (пункт #3), остальное во всех распространённых системах уже присутствует (кроме драйверов конечно).

Качаем драйвера.
Intel536EP_4.69.1_debian_support.tar.bz2 - работает на ядрах до версии 2.6.12
(md5 = 27cc5996f520bdbdcba54a32edfb6b65)
Intel536EP_4.69.1_debian_support_2.6.12+.tar.bz2 - работает на ядрах после версии 2.6.12 и до 2.6.17 (патч прилагается)
(md5 = e56cdce06e5acdf7eba77b5636a02b63)

alexweb провёл небольшое исследование и выяснил, что :
Цитата:
В ядре 2.6.17 снова произошли изменения и ни один из найденных мной архивов (в том числе и с патчами для дебиан) не собирался (ругается на отсутствие мембера flip в какой-то структуре ядра), пока я не порылся в списке архивов linmodems.technion.ac.il.
Там был найден следующий вариант дров

intel-536EP-2.56.76.0_21_09_2006.tgz- работает на ядрах ветки 2.6.17 и, ИМХО, выше (сам не проверял).
Все они прекрасно ставятся на Debian-like системах. (подправил Intel536_inst)


Инсталляция драйверов :

    1)копируем архив с драйверами в какую-нибудь папку (например в /tmp/drivers)
    2)распаковываем : tar jxvf *
    3) набираем в консоли :
    make clean && make 536 && make install
    4)Всё.

FAQ:

    1) ошибка связаная с lib/modules ... autoconf.h означает что вы не установили исходники ядра
    2) если нет исходников в дистрибутиве, но у вас есть архив с ядром, то возможно поможет
    символическая ссылка :
    ln -s путь_к_исходникам /usr/src/linux (если например вы распаковали ядро в папку /usr/src/linux-2.6.12, то команда будет такой : ln -s /usr/src/linux-2.6.12 /usr/src/linux)
    3) может у вас не создался симлинк автоматом на /dev/modem, тогда делаем его :
    ln -s /dev/536ep /dev/modem
    4)может у вас не загрузился модуль , тогда загружаем его : modprobe Intel536
    5) make install под рутом делаем ... :)
    6)Затрону немного и тему звонилок. Добавьте своего юзера в группу dip (для запуска kppp от непривилигированного пользователя), в kppp добавьте аргументы local, noauth. Для wvdial в /etc/wvdial.conf допишите Carrier check = no и Stupid Mode = on.


Ну вроде всё ... Больше никаких тем про Intel536EP на форуме надеюсь не потребуется.

_________________
Ненасилие ещё никому не помогало
Trying is the first step towards failure (c) Homer Simpson


Последний раз редактировалось kif0rt 27 дек 2006, 21:13, всего редактировалось 3 раз(а).

Вернуться к началу
 Не в сети Профиль  
Ответить с цитатой  
 Заголовок сообщения:
СообщениеДобавлено: 02 окт 2005, 12:33 
Интересующийся

У нас с: 08.09.2005
Сообщения: 56
с автором мануала мы пообщались, но может кто-нибудь поможет.
проблема пока не решается

в мандраке 10 всё работало,а вот в мандрива 2005(он же мандрак 10.2) не хочет

[root@localhost modem]# make clean
cd coredrv; make clean
make[1]: Entering directory `/home/q/modem/coredrv'
rm -f *.ko *.o *~ core
make[1]: Leaving directory `/home/q/modem/coredrv'
rm -f *.o *.ko
[root@localhost modem]# make 536
Module precompile check
Current running kernel is: 2.6.11-6mdk
/lib/modules... autoconf.h exists
diff: /boot/vmlinuz.autoconf.h: No such file or directory
autoconf.h matches running kernel
diff: /boot/vmlinuz.version.h: No such file or directory
version.h matches running kernel
uname -r|grep "2.6" && \
cd coredrv && make 536core_26 && \
cp Intel536.ko .. && cd .. && \
strip --strip-debug Intel536.ko && \
exit; \
ls Intel536.ko >/dev/null 2>&1 || uname -r | grep "2.6" && echo "Failed to build driver" && exit; \
if [ ]; then \
cd coredrv; make TARGET=TARGET_SELAH KERNEL_SOURCE_PATH= "PSTN_DEF=-DTARGET_SELAH -DTARGET_LINUX -DLINUX" 536core; \
else \
cd coredrv; make TARGET=TARGET_SELAH KERNEL_INCLUDES=/lib/modules/`uname -r`/build/include \
"PSTN_DEF=-DTARGET_SELAH -DTARGET_LINUX -DLINUX" 536core; \
fi ; \
cp Intel536.o .. ; \
if [ -a /boot/vmlinuz.version.h ]; then \
cp /boot/vmlinuz.version.h /lib/modules/`uname -r`/build/include/linux/version.h;\
fi
2.6.11-6mdk
make[1]: Entering directory `/home/q/modem/coredrv'
make -C /lib/modules/2.6.11-6mdk/build SUBDIRS=/home/q/modem/coredrv modules
make[2]: Entering directory `/usr/src/linux-2.6.11-6mdk'
CC [M] /home/q/modem/coredrv/coredrv.o
/home/q/modem/coredrv/coredrv.c:70: warning: type defaults to `int' in declaration of `EXPORT_SYMBOL_NOVERS'
/home/q/modem/coredrv/coredrv.c:70: warning: parameter names (without types) infunction declaration
/home/q/modem/coredrv/coredrv.c:70: warning: data definition has no type or storage class
/home/q/modem/coredrv/coredrv.c: In function `close':
/home/q/modem/coredrv/coredrv.c:416: warning: `pm_unregister' is deprecated (declared at include/linux/pm.h:111)
/home/q/modem/coredrv/coredrv.c: In function `hamproc_write':
/home/q/modem/coredrv/coredrv.c:660: warning: ignoring return value of `copy_from_user', declared with attribute warn_unused_result
/home/q/modem/coredrv/coredrv.c: At top level:
/home/q/modem/coredrv/coredrv.c:754: warning: initialization from incompatible pointer type
/home/q/modem/coredrv/coredrv.c:755: warning: initialization from incompatible pointer type
/home/q/modem/coredrv/coredrv.c: In function `kScheduleDPC':
/home/q/modem/coredrv/coredrv.c:861: warning: implicit declaration of function `pm_access'
/home/q/modem/coredrv/coredrv.c: In function `dspdrv_CommRamISR':
/home/q/modem/coredrv/coredrv.c:877: warning: function declaration isn't a prototype
/home/q/modem/coredrv/coredrv.c: At top level:
/home/q/modem/coredrv/coredrv.c:286: warning: 'power_callback' defined but not used
CC [M] /home/q/modem/coredrv/clmmain.o
CC [M] /home/q/modem/coredrv/rts.o
CC [M] /home/q/modem/coredrv/task.o
CC [M] /home/q/modem/coredrv/uart.o
CC [M] /home/q/modem/coredrv/wwh_dflt.o
CC [M] /home/q/modem/coredrv/locks.o
CC [M] /home/q/modem/coredrv/softserial_io.o
/home/q/modem/coredrv/softserial_io.c: In function `softserial_write':
/home/q/modem/coredrv/softserial_io.c:94: warning: ignoring return value of `copy_from_user', declared with attribute warn_unused_result
CC [M] /home/q/modem/coredrv/softserial_ioctl.o
CC [M] /home/q/modem/coredrv/softserial.o
/home/q/modem/coredrv/softserial.c: In function `softserial_register_tty':
/home/q/modem/coredrv/softserial.c:141: warning: assignment from incompatible pointer type
LD [M] /home/q/modem/coredrv/Intel536.o
Building modules, stage 2.
MODPOST
CC /home/q/modem/coredrv/Intel536.mod.o
LD [M] /home/q/modem/coredrv/Intel536.ko
make[2]: Leaving directory `/usr/src/linux-2.6.11-6mdk'
make[1]: Leaving directory `/home/q/modem/coredrv'
[root@localhost modem]# make install
rm -f /etc/hamregistry.bin
bash Intel536_inst
running kernel 2.6.11-6mdk
installing hamregistry, used for persistant storage
installing Intel 536 driver
mandrake Intel536_boot script
starting module and utilities
error loading Intel536
ERROR: Module Intel536 does not exist in /proc/modules
done

modprobe Intel536 тоже ничего не даёт

это работа драйвера для мандрака10.1
а у меня 10.2 может в этом проблема.
и как эти модули грузить не знаю


Вернуться к началу
 Не в сети Профиль  
Ответить с цитатой  
 Заголовок сообщения:
СообщениеДобавлено: 02 окт 2005, 13:56 
Неотъемлемая часть форума
Аватара пользователя

У нас с: 06.02.2002
Сообщения: 9760
Откуда: Менск
modprobe Intel536 что выводит?

_________________
Опыт растет прямо пропорционально выведенному из строя оборудованию


Вернуться к началу
 Не в сети Профиль  
Ответить с цитатой  
 Заголовок сообщения:
СообщениеДобавлено: 02 окт 2005, 18:00 
Интересующийся

У нас с: 08.09.2005
Сообщения: 56
[root@localhost modem]# modprobe Intel536
FATAL: Error inserting Intel536 (/lib/modules/2.6.11-6mdk/kernel/drivers/char/Intel536.ko): Unknown
symbol in module, or unknown parameter (see dmesg)

[root@localhost modem]# dmesg
fs_mk_dev: could not append to parent for <NULL>25
devfs_mk_dev: could not append to parent for <NULL>26
devfs_mk_dev: could not append to parent for <NULL>27
devfs_mk_dev: could not append to parent for <NULL>28
devfs_mk_dev: could not append to parent for <NULL>29
devfs_mk_dev: could not append to parent for <NULL>30
devfs_mk_dev: could not append to parent for <NULL>31
devfs_mk_dev: could not append to parent for <NULL>32
devfs_mk_dev: could not append to parent for <NULL>33
devfs_mk_dev: could not append to parent for <NULL>34
devfs_mk_dev: could not append to parent for <NULL>35
devfs_mk_dev: could not append to parent for <NULL>36
devfs_mk_dev: could not append to parent for <NULL>37
devfs_mk_dev: could not append to parent for <NULL>38
devfs_mk_dev: could not append to parent for <NULL>39
devfs_mk_dev: could not append to parent for <NULL>40
devfs_mk_dev: could not append to parent for <NULL>41
devfs_mk_dev: could not append to parent for <NULL>42
devfs_mk_dev: could not append to parent for <NULL>43
devfs_mk_dev: could not append to parent for <NULL>44
devfs_mk_dev: could not append to parent for <NULL>45
devfs_mk_dev: could not append to parent for <NULL>46
devfs_mk_dev: could not append to parent for <NULL>47
devfs_mk_dev: could not append to parent for <NULL>48
devfs_mk_dev: could not append to parent for <NULL>49
devfs_mk_dev: could not append to parent for <NULL>50
devfs_mk_dev: could not append to parent for <NULL>51
devfs_mk_dev: could not append to parent for <NULL>52
devfs_mk_dev: could not append to parent for <NULL>53
devfs_mk_dev: could not append to parent for <NULL>54
devfs_mk_dev: could not append to parent for <NULL>55
devfs_mk_dev: could not append to parent for <NULL>56
devfs_mk_dev: could not append to parent for <NULL>57
devfs_mk_dev: could not append to parent for <NULL>58
devfs_mk_dev: could not append to parent for <NULL>59
devfs_mk_dev: could not append to parent for <NULL>60
devfs_mk_dev: could not append to parent for <NULL>61
devfs_mk_dev: could not append to parent for <NULL>62
devfs_mk_dev: could not append to parent for <NULL>63
devfs_mk_dev: could not append to parent for <NULL>64
devfs_mk_dev: could not append to parent for <NULL>65
devfs_mk_dev: could not append to parent for <NULL>66
devfs_mk_dev: could not append to parent for <NULL>67
devfs_mk_dev: could not append to parent for <NULL>68
devfs_mk_dev: could not append to parent for <NULL>69
devfs_mk_dev: could not append to parent for <NULL>70
devfs_mk_dev: could not append to parent for <NULL>71
devfs_mk_dev: could not append to parent for <NULL>72
devfs_mk_dev: could not append to parent for <NULL>73
devfs_mk_dev: could not append to parent for <NULL>74
devfs_mk_dev: could not append to parent for <NULL>75
devfs_mk_dev: could not append to parent for <NULL>76
devfs_mk_dev: could not append to parent for <NULL>77
devfs_mk_dev: could not append to parent for <NULL>78
devfs_mk_dev: could not append to parent for <NULL>79
devfs_mk_dev: could not append to parent for <NULL>80
devfs_mk_dev: could not append to parent for <NULL>81
devfs_mk_dev: could not append to parent for <NULL>82
devfs_mk_dev: could not append to parent for <NULL>83
devfs_mk_dev: could not append to parent for <NULL>84
devfs_mk_dev: could not append to parent for <NULL>85
devfs_mk_dev: could not append to parent for <NULL>86
devfs_mk_dev: could not append to parent for <NULL>87
devfs_mk_dev: could not append to parent for <NULL>88
devfs_mk_dev: could not append to parent for <NULL>89
devfs_mk_dev: could not append to parent for <NULL>90
devfs_mk_dev: could not append to parent for <NULL>91
devfs_mk_dev: could not append to parent for <NULL>92
devfs_mk_dev: could not append to parent for <NULL>93
devfs_mk_dev: could not append to parent for <NULL>94
devfs_mk_dev: could not append to parent for <NULL>95
devfs_mk_dev: could not append to parent for <NULL>96
devfs_mk_dev: could not append to parent for <NULL>97
devfs_mk_dev: could not append to parent for <NULL>98
devfs_mk_dev: could not append to parent for <NULL>99
devfs_mk_dev: could not append to parent for <NULL>100
devfs_mk_dev: could not append to parent for <NULL>101
devfs_mk_dev: could not append to parent for <NULL>102
devfs_mk_dev: could not append to parent for <NULL>103
devfs_mk_dev: could not append to parent for <NULL>104
devfs_mk_dev: could not append to parent for <NULL>105
devfs_mk_dev: could not append to parent for <NULL>106
devfs_mk_dev: could not append to parent for <NULL>107
devfs_mk_dev: could not append to parent for <NULL>108
devfs_mk_dev: could not append to parent for <NULL>109
devfs_mk_dev: could not append to parent for <NULL>110
devfs_mk_dev: could not append to parent for <NULL>111
devfs_mk_dev: could not append to parent for <NULL>112
devfs_mk_dev: could not append to parent for <NULL>113
devfs_mk_dev: could not append to parent for <NULL>114
devfs_mk_dev: could not append to parent for <NULL>115
devfs_mk_dev: could not append to parent for <NULL>116
devfs_mk_dev: could not append to parent for <NULL>117
devfs_mk_dev: could not append to parent for <NULL>118
devfs_mk_dev: could not append to parent for <NULL>119
devfs_mk_dev: could not append to parent for <NULL>120
devfs_mk_dev: could not append to parent for <NULL>121
devfs_mk_dev: could not append to parent for <NULL>122
devfs_mk_dev: could not append to parent for <NULL>123
devfs_mk_dev: could not append to parent for <NULL>124
devfs_mk_dev: could not append to parent for <NULL>125
devfs_mk_dev: could not append to parent for <NULL>126
devfs_mk_dev: could not append to parent for <NULL>127
SyncLink serial driver $Revision: 4.28 $, tty major#253
SyncLink MultiPort driver $Revision: 4.29 $
devfs_mk_dev: could not append to parent for <NULL>0
devfs_mk_dev: could not append to parent for <NULL>1
devfs_mk_dev: could not append to parent for <NULL>2
devfs_mk_dev: could not append to parent for <NULL>3
devfs_mk_dev: could not append to parent for <NULL>4
devfs_mk_dev: could not append to parent for <NULL>5
devfs_mk_dev: could not append to parent for <NULL>6
devfs_mk_dev: could not append to parent for <NULL>7
devfs_mk_dev: could not append to parent for <NULL>8
devfs_mk_dev: could not append to parent for <NULL>9
devfs_mk_dev: could not append to parent for <NULL>10
devfs_mk_dev: could not append to parent for <NULL>11
devfs_mk_dev: could not append to parent for <NULL>12
devfs_mk_dev: could not append to parent for <NULL>13
devfs_mk_dev: could not append to parent for <NULL>14
devfs_mk_dev: could not append to parent for <NULL>15
devfs_mk_dev: could not append to parent for <NULL>16
devfs_mk_dev: could not append to parent for <NULL>17
devfs_mk_dev: could not append to parent for <NULL>18
devfs_mk_dev: could not append to parent for <NULL>19
devfs_mk_dev: could not append to parent for <NULL>20
devfs_mk_dev: could not append to parent for <NULL>21
devfs_mk_dev: could not append to parent for <NULL>22
devfs_mk_dev: could not append to parent for <NULL>23
devfs_mk_dev: could not append to parent for <NULL>24
devfs_mk_dev: could not append to parent for <NULL>25
devfs_mk_dev: could not append to parent for <NULL>26
devfs_mk_dev: could not append to parent for <NULL>27
devfs_mk_dev: could not append to parent for <NULL>28
devfs_mk_dev: could not append to parent for <NULL>29
devfs_mk_dev: could not append to parent for <NULL>30
devfs_mk_dev: could not append to parent for <NULL>31
devfs_mk_dev: could not append to parent for <NULL>32
devfs_mk_dev: could not append to parent for <NULL>33
devfs_mk_dev: could not append to parent for <NULL>34
devfs_mk_dev: could not append to parent for <NULL>35
devfs_mk_dev: could not append to parent for <NULL>36
devfs_mk_dev: could not append to parent for <NULL>37
devfs_mk_dev: could not append to parent for <NULL>38
devfs_mk_dev: could not append to parent for <NULL>39
devfs_mk_dev: could not append to parent for <NULL>40
devfs_mk_dev: could not append to parent for <NULL>41
devfs_mk_dev: could not append to parent for <NULL>42
devfs_mk_dev: could not append to parent for <NULL>43
devfs_mk_dev: could not append to parent for <NULL>44
devfs_mk_dev: could not append to parent for <NULL>45
devfs_mk_dev: could not append to parent for <NULL>46
devfs_mk_dev: could not append to parent for <NULL>47
devfs_mk_dev: could not append to parent for <NULL>48
devfs_mk_dev: could not append to parent for <NULL>49
devfs_mk_dev: could not append to parent for <NULL>50
devfs_mk_dev: could not append to parent for <NULL>51
devfs_mk_dev: could not append to parent for <NULL>52
devfs_mk_dev: could not append to parent for <NULL>53
devfs_mk_dev: could not append to parent for <NULL>54
devfs_mk_dev: could not append to parent for <NULL>55
devfs_mk_dev: could not append to parent for <NULL>56
devfs_mk_dev: could not append to parent for <NULL>57
devfs_mk_dev: could not append to parent for <NULL>58
devfs_mk_dev: could not append to parent for <NULL>59
devfs_mk_dev: could not append to parent for <NULL>60
devfs_mk_dev: could not append to parent for <NULL>61
devfs_mk_dev: could not append to parent for <NULL>62
devfs_mk_dev: could not append to parent for <NULL>63
devfs_mk_dev: could not append to parent for <NULL>64
devfs_mk_dev: could not append to parent for <NULL>65
devfs_mk_dev: could not append to parent for <NULL>66
devfs_mk_dev: could not append to parent for <NULL>67
devfs_mk_dev: could not append to parent for <NULL>68
devfs_mk_dev: could not append to parent for <NULL>69
devfs_mk_dev: could not append to parent for <NULL>70
devfs_mk_dev: could not append to parent for <NULL>71
devfs_mk_dev: could not append to parent for <NULL>72
devfs_mk_dev: could not append to parent for <NULL>73
devfs_mk_dev: could not append to parent for <NULL>74
devfs_mk_dev: could not append to parent for <NULL>75
devfs_mk_dev: could not append to parent for <NULL>76
devfs_mk_dev: could not append to parent for <NULL>77
devfs_mk_dev: could not append to parent for <NULL>78
devfs_mk_dev: could not append to parent for <NULL>79
devfs_mk_dev: could not append to parent for <NULL>80
devfs_mk_dev: could not append to parent for <NULL>81
devfs_mk_dev: could not append to parent for <NULL>82
devfs_mk_dev: could not append to parent for <NULL>83
devfs_mk_dev: could not append to parent for <NULL>84
devfs_mk_dev: could not append to parent for <NULL>85
devfs_mk_dev: could not append to parent for <NULL>86
devfs_mk_dev: could not append to parent for <NULL>87
devfs_mk_dev: could not append to parent for <NULL>88
devfs_mk_dev: could not append to parent for <NULL>89
devfs_mk_dev: could not append to parent for <NULL>90
devfs_mk_dev: could not append to parent for <NULL>91
devfs_mk_dev: could not append to parent for <NULL>92
devfs_mk_dev: could not append to parent for <NULL>93
devfs_mk_dev: could not append to parent for <NULL>94
devfs_mk_dev: could not append to parent for <NULL>95
devfs_mk_dev: could not append to parent for <NULL>96
devfs_mk_dev: could not append to parent for <NULL>97
devfs_mk_dev: could not append to parent for <NULL>98
devfs_mk_dev: could not append to parent for <NULL>99
devfs_mk_dev: could not append to parent for <NULL>100
devfs_mk_dev: could not append to parent for <NULL>101
devfs_mk_dev: could not append to parent for <NULL>102
devfs_mk_dev: could not append to parent for <NULL>103
devfs_mk_dev: could not append to parent for <NULL>104
devfs_mk_dev: could not append to parent for <NULL>105
devfs_mk_dev: could not append to parent for <NULL>106
devfs_mk_dev: could not append to parent for <NULL>107
devfs_mk_dev: could not append to parent for <NULL>108
devfs_mk_dev: could not append to parent for <NULL>109
devfs_mk_dev: could not append to parent for <NULL>110
devfs_mk_dev: could not append to parent for <NULL>111
devfs_mk_dev: could not append to parent for <NULL>112
devfs_mk_dev: could not append to parent for <NULL>113
devfs_mk_dev: could not append to parent for <NULL>114
devfs_mk_dev: could not append to parent for <NULL>115
devfs_mk_dev: could not append to parent for <NULL>116
devfs_mk_dev: could not append to parent for <NULL>117
devfs_mk_dev: could not append to parent for <NULL>118
devfs_mk_dev: could not append to parent for <NULL>119
devfs_mk_dev: could not append to parent for <NULL>120
devfs_mk_dev: could not append to parent for <NULL>121
devfs_mk_dev: could not append to parent for <NULL>122
devfs_mk_dev: could not append to parent for <NULL>123
devfs_mk_dev: could not append to parent for <NULL>124
devfs_mk_dev: could not append to parent for <NULL>125
devfs_mk_dev: could not append to parent for <NULL>126
devfs_mk_dev: could not append to parent for <NULL>127
SyncLink MultiPort driver $Revision: 4.29 $, tty major#252
hw_random: RNG not detected
Linux agpgart interface v0.100 (c) Dave Jones
agpgart: Detected an Intel i845 Chipset.
agpgart: Maximum main memory to use for agp memory: 439M
agpgart: AGP aperture is 128M @ 0xd0000000
Supermount version 2.0.4 for kernel 2.6
ntfs: Ignoring new-style parameters in presence of obsolete ones
NTFS driver 2.1.22 [Flags: R/O DEBUG MODULE].
NTFS volume version 3.1.
NTFS volume version 3.1.
FAT: utf8 is not a recommended IO charset for FAT filesystems, filesystem will be case sensitive!
NTFS volume version 3.1.
loop: loaded (max 8 devices)
hdc: ATAPI 48X DVD-ROM DVD-R CD-R/RW drive, 2048kB Cache, UDMA(33)
Uniform CD-ROM driver Revision: 3.20
hdd: ATAPI 40X CD-ROM CD-R/RW drive, 2048kB Cache, UDMA(33)
Floppy drive(s): fd0 is 1.44M
FDC 0 is a post-1991 82077
IPVS: Registered protocols (TCP, UDP, AH, ESP)
IPVS: Connection hash table configured (size=4096, memory=32Kbytes)
IPVS: Each connection entry needs 120 bytes at least
IPVS: ipvs loaded.
NET: Registered protocol family 17
CSLIP: code copyright 1989 Regents of the University of California
PPP generic driver version 2.4.2
parport0: PC-style at 0x378 [PCSPP,TRISTATE]
lp0: using parport0 (polling).
lp0: console ready
Bluetooth: Core ver 2.7
NET: Registered protocol family 31
Bluetooth: HCI device and connection manager initialized
Bluetooth: HCI socket layer initialized
Bluetooth: L2CAP ver 2.7
Bluetooth: L2CAP socket layer initialized
Bluetooth: RFCOMM ver 1.5
Bluetooth: RFCOMM socket layer initialized
Bluetooth: RFCOMM TTY layer initialized
NET: Registered protocol family 10
Disabled Privacy Extensions on device c03b26e0(lo)
IPv6 over IPv4 tunneling driver
Disabled Privacy Extensions on device dcdf5800(sit0)
Installing knfsd (copyright (C) 1996 okir@monad.swb.de).
Intel536: no version magic, tainting kernel.
Intel536: module license 'Proprietary' taints kernel.
Intel536: Unknown symbol pm_access
bootsplash 3.1.6-2004/03/31: looking for picture...<6>...found (800x600, 10640 bytes, v3).
bootsplash: status on console 0 changed to on
bootsplash 3.1.6-2004/03/31: looking for picture...<6>...found (800x600, 10640 bytes, v3).
bootsplash: status on console 1 changed to on
bootsplash 3.1.6-2004/03/31: looking for picture...<6>...found (800x600, 10640 bytes, v3).
bootsplash: status on console 2 changed to on
bootsplash 3.1.6-2004/03/31: looking for picture...<6>...found (800x600, 10640 bytes, v3).
bootsplash: status on console 3 changed to on
bootsplash 3.1.6-2004/03/31: looking for picture...<6>...found (800x600, 10640 bytes, v3).
bootsplash: status on console 4 changed to on
bootsplash 3.1.6-2004/03/31: looking for picture...<6>...found (800x600, 10640 bytes, v3).
bootsplash: status on console 5 changed to on
Intel536: no version magic, tainting kernel.
Intel536: Unknown symbol pm_access
Intel536: Unknown symbol pm_access


Вернуться к началу
 Не в сети Профиль  
Ответить с цитатой  
 Заголовок сообщения:
СообщениеДобавлено: 13 окт 2005, 11:05 
Интересующийся

У нас с: 08.09.2005
Сообщения: 56
наверное проблема не разрешима :roll: :(


Вернуться к началу
 Не в сети Профиль  
Ответить с цитатой  
 Заголовок сообщения:
СообщениеДобавлено: 23 окт 2005, 14:49 
Интересующийся

У нас с: 08.09.2005
Сообщения: 56
пришлось вернуться в mandrake 10
:cry::cry::oops::cry:


Вернуться к началу
 Не в сети Профиль  
Ответить с цитатой  
 Заголовок сообщения:
СообщениеДобавлено: 26 окт 2005, 08:14 
Заглянувший

У нас с: 26.10.2005
Сообщения: 1
YA писал(а):
пришлось вернуться в mandrake 10
:cry::cry::oops::cry:

Может поделитесь дровеями под Мандраку 10.0 а то чёт у меня всё собирается а железка подтягивать дровишки не хочет при попытке проинициализировать мопед висюк, пдение клавы ну а дальше приплыли!


Вернуться к началу
 Не в сети Профиль  
Ответить с цитатой  
 Заголовок сообщения:
СообщениеДобавлено: 31 окт 2005, 10:49 
Интересующийся

У нас с: 08.09.2005
Сообщения: 56
драйвера я брал на сайте INTEL


Вернуться к началу
 Не в сети Профиль  
Ответить с цитатой  
 Заголовок сообщения:
СообщениеДобавлено: 07 ноя 2005, 19:46 
Заглянувший

У нас с: 06.11.2005
Сообщения: 1
У меня на таком модеме в кппп в опросе момеда выдает все пустые строчки, а ввдиал выдает "Modem not responding" Все дрова собрались и установились правильно. В чем может быть причина, где рыть? Дело происходит в Debian 3.1 2.6.10-5 в Ubuntu 5.04 все пахало...


Вернуться к началу
 Не в сети Профиль  
Ответить с цитатой  
 Заголовок сообщения:
СообщениеДобавлено: 10 ноя 2005, 11:17 
Интересующийся

У нас с: 08.09.2005
Сообщения: 56
я вот поставил SUSE 10 и та же проблема.
самое интересное- в самом дистрибутиве есть rpm пакет на этот модем. он ставиться , а модем не работает:cry:
пробовал его удалить и поставить из исходников-так они не ставяться:cry::cry:


Вернуться к началу
 Не в сети Профиль  
Ответить с цитатой  
 Заголовок сообщения:
СообщениеДобавлено: 10 ноя 2005, 23:24 
Неотъемлемая часть форума
Аватара пользователя

У нас с: 03.11.2004
Сообщения: 1373
Откуда: Минск
YA писал(а):
я вот поставил SUSE 10 и та же проблема.
самое интересное- в самом дистрибутиве есть rpm пакет на этот модем. он ставиться , а модем не работает:cry:
пробовал его удалить и поставить из исходников-так они не ставяться:cry::cry:


Этот пакет вроде - не сами дрова, а какие-то утилиты ... Можешь написать какую ошибку при установке дров из исходников выдаёт !?

_________________
Ненасилие ещё никому не помогало
Trying is the first step towards failure (c) Homer Simpson


Вернуться к началу
 Не в сети Профиль  
Ответить с цитатой  
 Заголовок сообщения:
СообщениеДобавлено: 12 ноя 2005, 21:15 
Интересующийся

У нас с: 08.09.2005
Сообщения: 56
linux:/home/alex/modem # make clean
cd coredrv; make clean
make[1]: Entering directory `/home/alex/modem/coredrv'
rm -f *.ko *.o *~ core
make[1]: Leaving directory `/home/alex/modem/coredrv'
rm -f *.o *.ko
linux:/home/alex/modem # make 536
Module precompile check
Current running kernel is: 2.6.13-15-default
/lib/modules... autoconf.h exists
diff: /boot/vmlinuz.autoconf.h: No such file or directory
autoconf.h matches running kernel
diff: /boot/vmlinuz.version.h: No such file or directory
version.h matches running kernel
uname -r|grep "2.6" && \
cd coredrv && make 536core_26 && \
cp Intel536.ko .. && cd .. && \
strip --strip-debug Intel536.ko && \
exit; \
ls Intel536.ko >/dev/null 2>&1 || uname -r | grep "2.6" && echo "Failed to build driver" && exit; \
if [ ]; then \
cd coredrv; make TARGET=TARGET_SELAH KERNEL_SOURCE_PATH= "PSTN_DEF=-DTARGET_SELAH -DTARGET_LINUX -DLINUX" 536core; \
else \
cd coredrv; make TARGET=TARGET_SELAH KERNEL_INCLUDES=/lib/modules/`uname -r`/build/include \
"PSTN_DEF=-DTARGET_SELAH -DTARGET_LINUX -DLINUX" 536core; \
fi ; \
cp Intel536.o .. ; \
if [ -a /boot/vmlinuz.version.h ]; then \
cp /boot/vmlinuz.version.h /lib/modules/`uname -r`/build/include/linux/version.h;\
fi
2.6.13-15-default
make[1]: Entering directory `/home/alex/modem/coredrv'
make -C /lib/modules/2.6.13-15-default/build SUBDIRS=/home/alex/modem/coredrv modules
make[2]: Entering directory `/usr/src/linux-2.6.13-15-obj/i386/default'
make -C ../../../linux-2.6.13-15 O=../linux-2.6.13-15-obj/i386/default modules
CC [M] /home/alex/modem/coredrv/coredrv.o
gcc: ../inc: No such file or directory
/home/alex/modem/coredrv/coredrv.c:70: warning: type defaults to ‘int’ in declaration of ‘EXPORT_SYMBOL_NOVERS’
/home/alex/modem/coredrv/coredrv.c:70: warning: parameter names (without types) in function declaration
/home/alex/modem/coredrv/coredrv.c:70: warning: data definition has no type or storage class
/home/alex/modem/coredrv/coredrv.c: In function ‘softcore_init_struct’:
/home/alex/modem/coredrv/coredrv.c:336: warning: assignment from incompatible pointer type
/home/alex/modem/coredrv/coredrv.c: In function ‘close’:
/home/alex/modem/coredrv/coredrv.c:416: warning: ‘pm_unregister’ is deprecated (declared at /usr/src/linux-2.6.13-15/include/linux/pm.h:112)
/home/alex/modem/coredrv/coredrv.c: In function ‘hamproc_write’:
/home/alex/modem/coredrv/coredrv.c:660: warning: ignoring return value of ‘copy_from_user’, declared with attribute warn_unused_result
/home/alex/modem/coredrv/coredrv.c: At top level:
/home/alex/modem/coredrv/coredrv.c:754: warning: initialization from incompatible pointer type
/home/alex/modem/coredrv/coredrv.c:755: warning: initialization from incompatible pointer type
/home/alex/modem/coredrv/coredrv.c: In function ‘kScheduleDPC’:
/home/alex/modem/coredrv/coredrv.c:861: error: implicit declaration of function ‘pm_access’
/home/alex/modem/coredrv/coredrv.c: In function ‘dspdrv_CommRamISR’:
/home/alex/modem/coredrv/coredrv.c:877: warning: function declaration isn’t a prototype
make[5]: *** [/home/alex/modem/coredrv/coredrv.o] Ошибка 1
make[4]: *** [_module_/home/alex/modem/coredrv] Ошибка 2
make[3]: *** [modules] Ошибка 2
make[2]: *** [modules] Ошибка 2
make[2]: Leaving directory `/usr/src/linux-2.6.13-15-obj/i386/default'
make[1]: *** [536core_26] Ошибка 2
make[1]: Leaving directory `/home/alex/modem/coredrv'
2.6.13-15-default
Failed to build driver
linux:/home/alex/modem # make install
rm -f /etc/hamregistry.bin
bash Intel536_inst
running kernel 2.6.13-15-default
installing hamregistry, used for persistant storage
installing Intel536 driver
install: невозможно выполнить stat для `Intel536.ko': No such file or directory
make: *** [install] Ошибка 1


Вернуться к началу
 Не в сети Профиль  
Ответить с цитатой  
 Заголовок сообщения:
СообщениеДобавлено: 02 мар 2006, 11:34 
Неотъемлемая часть форума
Аватара пользователя

У нас с: 06.02.2002
Сообщения: 9760
Откуда: Менск
kif0rt, перенеси чтоль в wiki/FAQ?

_________________
Опыт растет прямо пропорционально выведенному из строя оборудованию


Вернуться к началу
 Не в сети Профиль  
Ответить с цитатой  
 Заголовок сообщения:
СообщениеДобавлено: 02 мар 2006, 14:42 
Неотъемлемая часть форума
Аватара пользователя

У нас с: 03.11.2004
Сообщения: 1373
Откуда: Минск
Llama писал(а):
kif0rt, перенеси чтоль в wiki/FAQ?


Впадлу разбираться с wiki... поэтому не обещаю , что это случиться скоро.

_________________
Ненасилие ещё никому не помогало
Trying is the first step towards failure (c) Homer Simpson


Вернуться к началу
 Не в сети Профиль  
Ответить с цитатой  
 Заголовок сообщения:
СообщениеДобавлено: 30 апр 2006, 19:59 
Интересующийся

У нас с: 08.09.2005
Сообщения: 56
вопрос с модемом решается простым переходом на ADSL8)


Вернуться к началу
 Не в сети Профиль  
Ответить с цитатой  
Показать сообщения за:  Поле сортировки  
Начать новую тему Ответить на тему  [ Сообщений: 30 ]  На страницу 1, 2  След.


Вы не можете начинать темы
Вы не можете отвечать на сообщения
Вы не можете редактировать свои сообщения
Вы не можете удалять свои сообщения
Вы не можете добавлять вложения

Найти:
Перейти:  
cron
[ All resources are available under GNU GPL ] [ Support ] [ Hosted by DataHata | MyCloud.by ] [ Powered by phpBB® Forum Software © phpBB Group ]

LVEE Winter LVEE Rambler's Top100